Target
Histone-lysine N-methyltransferase EZH2
Ligand
BDBM325914
Substrate
Meas. Tech.
Enzyme Assay
IC50
<300±n/a nM
Citation
 Kuntz, KWOlhava, EJChesworth, RDuncan, KW Substituted 6,5-fused bicyclic heteroaryl compounds US Patent  US9637472 Publication Date 5/2/2017 
Target
Name:
Histone-lysine N-methyltransferase EZH2
Synonyms:
ENX-1 EZH2_HUMAN Histone-lysine N-methyltransferase EZH2 Lysine N-methyltransferase 6
Type:
Protein
Mol. Mass.:
85367.84
Organism:
Homo sapiens (Human)
Description:
Q15910
Residue:
746
  
Inhibitor
Name:
BDBM325914
Synonyms:
US10273223, Compound B-8 | US9637472, Compound B-8
Type:
Small organic molecule
Emp. Form.:
C28H37N7O3
Mol. Mass.:
519.6385
SMILES:
CC(C)n1ncc2c(cc(nc12)C1CCN(CC1)C(=O)C1CN(C)C1)C(=O)NCc1c(C)cc(C)[nH]c1=O
: