Target
Histone-lysine N-methyltransferase EZH2
Ligand
BDBM326084
Substrate
Meas. Tech.
Enzyme Assay
IC50
<300±n/a nM
Citation
 Kuntz, KWOlhava, EJChesworth, RDuncan, KW Substituted 6,5-fused bicyclic heteroaryl compounds US Patent  US9637472 Publication Date 5/2/2017 
Target
Name:
Histone-lysine N-methyltransferase EZH2
Synonyms:
ENX-1 EZH2_HUMAN Histone-lysine N-methyltransferase EZH2 Lysine N-methyltransferase 6
Type:
Protein
Mol. Mass.:
85367.84
Organism:
Homo sapiens (Human)
Description:
Q15910
Residue:
746
  
Inhibitor
Name:
BDBM326084
Synonyms:
US10273223, Compound C-17 | US9637472, Compound C-17
Type:
Small organic molecule
Emp. Form.:
C34H44N6O2
Mol. Mass.:
568.7522
SMILES:
CN(C)CCCN(C)Cc1ccc(cc1)-c1cc(C(=O)NCc2c(C)cc(C)[nH]c2=O)c2cnn(C3CCCC3)c2c1
: