Target
Tyrosine-protein kinase BTK
Ligand
BDBM326214
Substrate
Meas. Tech.
LANCE (Lanthanide Chelate Excite) TR-FRET (Time-resolved fluorescence resonance energy transfer) assay
IC50
56.9±n/a nM
Citation
 Liu, JKim, RMKozlowski, JKrikorian, ADAnand, R Btk inhibitors US Patent  US9637486 Publication Date 5/2/2017 
Target
Name:
Tyrosine-protein kinase BTK
Synonyms:
AGMX1 Agammaglobulinaemia tyrosine kinase B cell progenitor kinase BPK BTK_HUMAN Tyrosine Kinase BTK Tyrosine-protein kinase BTK (BTK)
Type:
Enzyme
Mol. Mass.:
76289.95
Organism:
Homo sapiens (Human)
Description:
Q06187
Residue:
659
  
Inhibitor
Name:
BDBM326214
Synonyms:
(R)-(3-(7-amino-1-(4-(4-fluorophenoxy)phenyl)-1H-pyrazolo[3,4-c]pyridin-3-yl)piperidin-1-yl)(3-methyloxetan-3-yl)methanone | US9637486, Example 26
Type:
Small organic molecule
Emp. Form.:
C28H28FN5O3
Mol. Mass.:
501.552
SMILES:
CC1(COC1)C(=O)N1CCC[C@H](C1)c1nn(-c2ccc(Oc3ccc(F)cc3)cc2)c2c(N)nccc12
: