Target
Tyrosine-protein kinase BTK
Ligand
BDBM326231
Substrate
Meas. Tech.
In Vitro Inhibitory Assay
IC50
<100±n/a nM
Citation
 Chen, WJia, ZJLoury, DJ Purinone compounds as kinase inhibitors US Patent  US9637487 Publication Date 5/2/2017 
Target
Name:
Tyrosine-protein kinase BTK
Synonyms:
AGMX1 Agammaglobulinaemia tyrosine kinase B cell progenitor kinase BPK BTK_HUMAN Tyrosine Kinase BTK Tyrosine-protein kinase BTK (BTK)
Type:
Enzyme
Mol. Mass.:
76289.95
Organism:
Homo sapiens (Human)
Description:
Q06187
Residue:
659
  
Inhibitor
Name:
BDBM326231
Synonyms:
(E)-4-(6-amino-9-(3-(4-(dimethylamino)-N-methylbut-2-enamido)phenyl)-8-oxo-8,9-dihydro-7H-purin-7-yl)-N-(4-methylthiazol-2-yl)benzamide | US9637487, Compound 20
Type:
Small organic molecule
Emp. Form.:
C29H29N9O3S
Mol. Mass.:
583.664
SMILES:
CN(C)C\C=C\C(=O)N(C)c1cccc(c1)-n1c2ncnc(N)c2n(-c2ccc(cc2)C(=O)Nc2nc(C)cs2)c1=O
: