Target
Phosphatidylinositol 4,5-bisphosphate 3-kinase catalytic subunit gamma isoform
Ligand
BDBM326272
Substrate
Meas. Tech.
Inhibition Assay
IC50
7.10±n/a nM
Citation
 Ruan, F Heterocyclic compounds as inhibitors of class I PI3KS US Patent  US9637488 Publication Date 5/2/2017 
Target
Name:
Phosphatidylinositol 4,5-bisphosphate 3-kinase catalytic subunit gamma isoform
Synonyms:
PI3-kinase p110 subunit gamma PI3Kgamma PK3CG_HUMAN Phosphatidylinositol 4,5-bisphosphate 3-kinase (PI3K) Phosphatidylinositol 4,5-bisphosphate 3-kinase catalytic subunit gamma (PI3Kgamma) Phosphatidylinositol 4,5-bisphosphate 3-kinase catalytic subunit gamma isoform (PI3K) Phosphatidylinositol-4,5-bisphosphate 3-kinase catalytic subunit gamma isoform Phosphoinositide 3-kinases gamma (PI3K gamma) p120-PI3K
Type:
Enzyme Subunit
Mol. Mass.:
126470.30
Organism:
Homo sapiens (Human)
Description:
P48736
Residue:
1102
  
Inhibitor
Name:
BDBM326272
Synonyms:
US9637488, 38 | US9637488, 43
Type:
Small organic molecule
Emp. Form.:
C23H24FN7O
Mol. Mass.:
433.4814
SMILES:
Fc1ccc2cc(C3CCCCN3c3ncnc4[nH]cnc34)c(nc2c1)N1CCOCC1
: