Target
E3 ubiquitin-protein ligase Mdm2 [17-125]
Ligand
BDBM326329
Substrate
Meas. Tech.
FRET Assay
IC50
2.00±n/a nM
Citation
 Dinsmore, CFradera Llinas, FXKudale, AAMachacek, MReutershan, MHThompson, CFTrotter, BWYang, LAltman, MDBogen, SLDoll, RJVoss, ME Substituted pyrrolopyrimidines as HDM2 inhibitors US Patent  US9637493 Publication Date 5/2/2017 
Target
Name:
E3 ubiquitin-protein ligase Mdm2 [17-125]
Synonyms:
Double minute 2 protein MDM2 p53-binding protein Mdm2
Type:
Enzyme Catalytic Domain
Mol. Mass.:
12522.24
Organism:
Homo sapiens (Human)
Description:
Residue 17 to 125
Residue:
109
  
Inhibitor
Name:
BDBM326329
Synonyms:
3-{4-(5-chloropyridin-3- yl)-6-[fluoro(2- fluorophenyl)methyl]-5- [(trans-4- methylcyclohexyl)methyl]- 5H-pyrrolo[3,2- d]pyrimidin-2-yl}-1,2,4- oxadiazol-5(4H)-one (racemate) | US9637493, 8.2
Type:
Small organic molecule
Emp. Form.:
C28H25ClF2N6O2
Mol. Mass.:
550.987
SMILES:
C[C@H]1CC[C@H](Cn2c(cc3nc(nc(-c4cncc(Cl)c4)c23)-c2noc(=O)[nH]2)C(F)c2ccccc2F)CC1
: