Target
Orexin/Hypocretin receptor type 1
Ligand
BDBM164136
Substrate
Meas. Tech.
Rat and Human Orexin 1 Receptor Radioligand Binding Assay
Ki
7.00±n/a nM
Citation
 Coate, HRDvorak, CAFitzgerald, AELebold, TPPreville, CShireman, BT Substituted 7-azabicycles and their use as orexin receptor modulators US Patent  US9637496 Publication Date 5/2/2017 
Target
Name:
Orexin/Hypocretin receptor type 1
Synonyms:
HCRTR1 OX1R_HUMAN Orexin receptor type 1 (OR 1) Orexin receptor type 1 (OX1) Orexin receptor type 1 (OxR1) | Ox1r
Type:
Protein
Mol. Mass.:
47554.50
Organism:
Homo sapiens (Human)
Description:
O43613
Residue:
425
  
Inhibitor
Name:
BDBM164136
Synonyms:
US9062078, 266 US9637496, 409 | US9695183, 266
Type:
Small organic molecule
Emp. Form.:
C22H20F3N5O2
Mol. Mass.:
443.4217
SMILES:
Cc1cccc(C(=O)N2C3CCC2C(C3)Nc2cnc(cn2)C(F)(F)F)c1-c1ncco1
: