Target
Muscarinic acetylcholine receptor M1
Ligand
BDBM193800
Substrate
Meas. Tech.
Receptor Selection and Amplification Assays
EC50
10.00±n/a nM
Citation
 Burstein, ESEskildsen, JOlsson, R Muscarinic agonists US Patent  US9670209 Publication Date 6/6/2017 
Target
Name:
Muscarinic acetylcholine receptor M1
Synonyms:
ACM1_HUMAN Cholinergic receptor, muscarinic 1 | Cholinergic, muscarinic M1
Type:
Protein
Mol. Mass.:
51442.54
Organism:
Homo sapiens (Human)
Description:
P11229
Residue:
460
  
Inhibitor
Name:
BDBM193800
Synonyms:
US9670209, Compound 311 1-((R)-3-(3-(cyclopropylmethoxy)-8-aza-bicyclo[3.2.1]octan-8-yl)-3-methylpropyl)-6-methoxy-1H-indazole
Type:
Small organic molecule
Emp. Form.:
C23H33N3O2
Mol. Mass.:
383.527
SMILES:
COc1ccc2cnn(C[C@H](C)CN3[C@H]4CC[C@@H]3C[C@@H](C4)OCC3CC3)c2c1
: