Target
Muscarinic acetylcholine receptor M2
Ligand
BDBM193804
Substrate
Meas. Tech.
Receptor Selection and Amplification Assays
EC50
50±n/a nM
Citation
 Burstein, ESEskildsen, JOlsson, R Muscarinic agonists US Patent  US9670209 Publication Date 6/6/2017 
Target
Name:
Muscarinic acetylcholine receptor M2
Synonyms:
ACM2_HUMAN Cholinergic, muscarinic M2 Muscarinic acetylcholine receptor M2 and M5 | RecName: Full=Muscarinic acetylcholine receptor M2
Type:
GPCR
Mol. Mass.:
51730.61
Organism:
Homo sapiens (Human)
Description:
P08172
Residue:
466
  
Inhibitor
Name:
BDBM193804
Synonyms:
US9670209, Compound 314 1-((R)-3-((1R,3R,58)-3-(cyclopentyloxy)-8-azabicyclo[3.2.1]octan-8-yl)-2-methylpropyl)-1H-indazole
Type:
Small organic molecule
Emp. Form.:
C23H33N3O
Mol. Mass.:
367.5276
SMILES:
C[C@H](CN1[C@H]2CC[C@@H]1C[C@@H](C2)OC1CCCC1)Cn1ncc2ccccc12
: