Target
Muscarinic acetylcholine receptor M1
Ligand
BDBM193806
Substrate
Meas. Tech.
Receptor Selection and Amplification Assays
EC50
13±n/a nM
Citation
 Burstein, ESEskildsen, JOlsson, R Muscarinic agonists US Patent  US9670209 Publication Date 6/6/2017 
Target
Name:
Muscarinic acetylcholine receptor M1
Synonyms:
ACM1_HUMAN Cholinergic receptor, muscarinic 1 | Cholinergic, muscarinic M1
Type:
Protein
Mol. Mass.:
51442.54
Organism:
Homo sapiens (Human)
Description:
P11229
Residue:
460
  
Inhibitor
Name:
BDBM193806
Synonyms:
US9670209, Compound 316 1-((R)-3-(3-(cyclopropylmethoxy)-8-aza-bicyclo[3.2.1]octan-8-yl)-2-methylpropyl)-3-methyl-1H-indazole
Type:
Small organic molecule
Emp. Form.:
C23H33N3O
Mol. Mass.:
367.5276
SMILES:
C[C@H](CN1[C@H]2CC[C@@H]1C[C@@H](C2)OCC1CC1)Cn1nc(C)c2ccccc12
: