Target
Dipeptidyl peptidase 4
Ligand
BDBM11113
Substrate
BDBM11526
Meas. Tech.
Dipeptidyl Peptidase Inhibition Assay
pH
8±n/a
Temperature
310.15±n/a K
IC50
53±8 nM
Citation
 Tsu, HChen, XChen, CTLee, SJChang, CNKao, KHCoumar, MSYeh, YTChien, CHWang, HSLin, KTChang, YYWu, SHChen, YSLu, ILWu, SYTsai, TYChen, WCHsieh, HPChao, YSJiaang, WT 2-[3-[2-[(2S)-2-Cyano-1-pyrrolidinyl]-2-oxoethylamino]-3-methyl-1-oxobutyl]-1,2,3,4-tetrahydroisoquinoline: a potent, selective, and orally bioavailable dipeptide-derived inhibitor of dipeptidyl peptidase IV. J Med Chem 49:373-80 (2006)  
Target
Name:
Dipeptidyl peptidase 4
Synonyms:
ADABP Adenosine deaminase complexing protein 2 CD_antigen=CD26 DPP4 DPPIV Dipeptidyl peptidase 4 (DPP IV) Dipeptidyl peptidase 4 (DPP4) Dipeptidyl peptidase 4 membrane form Dipeptidyl peptidase IV Dipeptidyl peptidase IV (DDP-IV) Dipeptidyl peptidase IV membrane form Dipeptidyl peptidase-IV (DPP-4) T-cell activation antigen CD26 | TP103
Type:
Enzyme
Mol. Mass.:
88271.01
Organism:
Homo sapiens (Human)
Description:
P27487
Residue:
766
  
Inhibitor
Name:
BDBM11113
Synonyms:
6-{[2-({2-[(2S)-2-cyanopyrrolidin-1-yl]-2-oxoethyl}amino)ethyl]amino}pyridine-3-carbonitrile CHEMBL77538 cyano-(S)-pyrrolidine deriv. 1 | cyanopyrrolidine derivative 2
Type:
Small organic molecule
Emp. Form.:
C15H18N6O
Mol. Mass.:
298.343
SMILES:
O=C(CNCCNc1ccc(cn1)C#N)N1CCC[C@H]1C#N
:
Substrate
Name:
BDBM11526
Synonyms:
1-(2-aminoacetyl)-N-(4-nitrophenyl)pyrrolidine-2-carboxamide Gly-Pro-pNA
Type:
Small organic molecule
Emp. Form.:
C13H16N4O4
Mol. Mass.:
292.2905
SMILES:
NCC(=O)N1CCCC1C(=O)Nc1ccc(cc1)[N+]([O-])=O
: