Target
Dipeptidyl peptidase 8
Ligand
BDBM11703
Substrate
BDBM11526
Meas. Tech.
Dipeptidyl Peptidase Inhibition Assay
IC50
2000±n/a nM
Citation
 Tsu, HChen, XChen, CTLee, SJChang, CNKao, KHCoumar, MSYeh, YTChien, CHWang, HSLin, KTChang, YYWu, SHChen, YSLu, ILWu, SYTsai, TYChen, WCHsieh, HPChao, YSJiaang, WT 2-[3-[2-[(2S)-2-Cyano-1-pyrrolidinyl]-2-oxoethylamino]-3-methyl-1-oxobutyl]-1,2,3,4-tetrahydroisoquinoline: a potent, selective, and orally bioavailable dipeptide-derived inhibitor of dipeptidyl peptidase IV. J Med Chem 49:373-80 (2006)  
Target
Name:
Dipeptidyl peptidase 8
Synonyms:
DPP8 DPRP-1 Dipeptidyl peptidase 8 (DPP-8) Dipeptidyl peptidase 8/9 Dipeptidyl peptidase VIII Prolyl dipeptidase DPP8
Type:
Enzyme
Mol. Mass.:
103342.62
Organism:
Homo sapiens (Human)
Description:
Q6V1X1
Residue:
898
  
Inhibitor
Name:
BDBM11703
Synonyms:
(2S)-Cyanopyrrolidine analogue 18g | 1-{4-[3-({2-[(2S)-2-cyanopyrrolidin-1-yl]-2-oxoethyl}amino)propanoyl]piperazin-1-yl}-1,6-dihydropyridine-3-carbonitrile
Type:
Small organic molecule
Emp. Form.:
C20H27N7O2
Mol. Mass.:
397.4741
SMILES:
O=C(CNCCC(=O)N1CCN(CC1)N1CC=CC(=C1)C#N)N1CCC[C@H]1C#N
:
Substrate
Name:
BDBM11526
Synonyms:
1-(2-aminoacetyl)-N-(4-nitrophenyl)pyrrolidine-2-carboxamide Gly-Pro-pNA
Type:
Small organic molecule
Emp. Form.:
C13H16N4O4
Mol. Mass.:
292.2905
SMILES:
NCC(=O)N1CCCC1C(=O)Nc1ccc(cc1)[N+]([O-])=O
: