Target
Dipeptidyl peptidase 8
Ligand
BDBM11715
Substrate
BDBM11526
Meas. Tech.
Dipeptidyl Peptidase Inhibition Assay
IC50
41859±n/a nM
Citation
 Tsu, HChen, XChen, CTLee, SJChang, CNKao, KHCoumar, MSYeh, YTChien, CHWang, HSLin, KTChang, YYWu, SHChen, YSLu, ILWu, SYTsai, TYChen, WCHsieh, HPChao, YSJiaang, WT 2-[3-[2-[(2S)-2-Cyano-1-pyrrolidinyl]-2-oxoethylamino]-3-methyl-1-oxobutyl]-1,2,3,4-tetrahydroisoquinoline: a potent, selective, and orally bioavailable dipeptide-derived inhibitor of dipeptidyl peptidase IV. J Med Chem 49:373-80 (2006)  
Target
Name:
Dipeptidyl peptidase 8
Synonyms:
DPP8 DPRP-1 Dipeptidyl peptidase 8 (DPP-8) Dipeptidyl peptidase 8/9 Dipeptidyl peptidase VIII Prolyl dipeptidase DPP8
Type:
Enzyme
Mol. Mass.:
103342.62
Organism:
Homo sapiens (Human)
Description:
Q6V1X1
Residue:
898
  
Inhibitor
Name:
BDBM11715
Synonyms:
(2S)-1-(2-{[(3R)-4-methyl-1-oxo-1-(1,2,3,4-tetrahydroisoquinolin-2-yl)pentan-3-yl]amino}acetyl)pyrrolidine-2-carbonitrile 2-[3-[2-[2-Cyano-(S)-pyrrolidin-1-yl]-2-oxoethylamino]-4-methyl-1-oxopentyl]-1,2,3,4-tetrahydroisoquinoline
Type:
Small organic molecule
Emp. Form.:
C22H30N4O2
Mol. Mass.:
382.4992
SMILES:
CC(C)[C@@H](CC(=O)N1CCc2ccccc2C1)NCC(=O)N1CCC[C@H]1C#N
:
Substrate
Name:
BDBM11526
Synonyms:
1-(2-aminoacetyl)-N-(4-nitrophenyl)pyrrolidine-2-carboxamide Gly-Pro-pNA
Type:
Small organic molecule
Emp. Form.:
C13H16N4O4
Mol. Mass.:
292.2905
SMILES:
NCC(=O)N1CCCC1C(=O)Nc1ccc(cc1)[N+]([O-])=O
: