Target
Dipeptidyl peptidase 2
Ligand
BDBM11711
Substrate
BDBM11526
Meas. Tech.
Dipeptidyl Peptidase Inhibition Assay
IC50
20720±n/a nM
Citation
 Tsu, HChen, XChen, CTLee, SJChang, CNKao, KHCoumar, MSYeh, YTChien, CHWang, HSLin, KTChang, YYWu, SHChen, YSLu, ILWu, SYTsai, TYChen, WCHsieh, HPChao, YSJiaang, WT 2-[3-[2-[(2S)-2-Cyano-1-pyrrolidinyl]-2-oxoethylamino]-3-methyl-1-oxobutyl]-1,2,3,4-tetrahydroisoquinoline: a potent, selective, and orally bioavailable dipeptide-derived inhibitor of dipeptidyl peptidase IV. J Med Chem 49:373-80 (2006)  
Target
Name:
Dipeptidyl peptidase 2
Synonyms:
DAP II DPP2_HUMAN Dipeptidyl aminopeptidase II Dipeptidyl peptidase 2 (DPP2) Dipeptidyl peptidase II (DPP II) Dipeptidyl peptidase II and dipeptidyl peptidase IV (DPP2 and DPP4) carboxytripeptidase dipeptidyl(amino)peptidase II | dipeptidylarylamidase
Type:
Protein
Mol. Mass.:
54339.29
Organism:
Homo sapiens (Human)
Description:
Q9UHL4
Residue:
492
  
Inhibitor
Name:
BDBM11711
Synonyms:
(2S)-Cyanopyrrolidine analogue 18o 3-[2-(2-Cyano-(S)-pyrrolidin-1-yl)-2-oxoethylamino]-N-phenethylpropionamide | CHEMBL201544
Type:
Small organic molecule
Emp. Form.:
C18H24N4O2
Mol. Mass.:
328.4088
SMILES:
O=C(CCNCC(=O)N1CCC[C@H]1C#N)NCCc1ccccc1
:
Substrate
Name:
BDBM11526
Synonyms:
1-(2-aminoacetyl)-N-(4-nitrophenyl)pyrrolidine-2-carboxamide Gly-Pro-pNA
Type:
Small organic molecule
Emp. Form.:
C13H16N4O4
Mol. Mass.:
292.2905
SMILES:
NCC(=O)N1CCCC1C(=O)Nc1ccc(cc1)[N+]([O-])=O
: