Target
Carboxypeptidase B2
Ligand
BDBM326378
Substrate
Meas. Tech.
Enzyme Inhibitory Assay
IC50
26.0±n/a nM
Citation
 Nagata, TKobayashi, JOnishi, YKishida, MNoguchi, K Cyclopropanecarboxylic acid derivative US Patent  US9662310 Publication Date 5/30/2017 
Target
Name:
Carboxypeptidase B2
Synonyms:
CBPB2_HUMAN CPU Carboxypeptidase B2 isoform A Plasma carboxypeptidase B Thrombin-activable fibrinolysis inhibitor | pCPB
Type:
Enzyme
Mol. Mass.:
48432.74
Organism:
Homo sapiens (Human)
Description:
Q96IY4
Residue:
423
  
Inhibitor
Name:
BDBM326378
Synonyms:
(1R*,2S*)-2-(3-Aminopropyl)-1-[1-(1-benzofuran-5-yl)-1H-imidazol-4-yl]cyclopropanecarboxylic acid | US9662310, Example 43
Type:
Small organic molecule
Emp. Form.:
C29H37N3O7
Mol. Mass.:
539.62
SMILES:
COC(=O)C1(CC1CCCN(C(=O)OC(C)(C)C)C(=O)OC(C)(C)C)c1cn(cn1)-c1ccc2occc2c1
: