Target
Carboxypeptidase B2
Ligand
BDBM326381
Substrate
Meas. Tech.
Enzyme Inhibitory Assay
IC50
16.0±n/a nM
Citation
 Nagata, TKobayashi, JOnishi, YKishida, MNoguchi, K Cyclopropanecarboxylic acid derivative US Patent  US9662310 Publication Date 5/30/2017 
Target
Name:
Carboxypeptidase B2
Synonyms:
CBPB2_HUMAN CPU Carboxypeptidase B2 isoform A Plasma carboxypeptidase B Thrombin-activable fibrinolysis inhibitor | pCPB
Type:
Enzyme
Mol. Mass.:
48432.74
Organism:
Homo sapiens (Human)
Description:
Q96IY4
Residue:
423
  
Inhibitor
Name:
BDBM326381
Synonyms:
(1R*,2S*)-2-(3-Aminopropyl)-1-(1-isoquinolin-3-yl-1H-imidazol-4-yl)cyclopropanecarboxylic acid | US9662310, Example 46
Type:
Small organic molecule
Emp. Form.:
C24H27N5O2
Mol. Mass.:
417.5035
SMILES:
CC(C)(C)OC(=O)NCCCC1CC1(C#N)c1cn(cn1)-c1cc2ccccc2cn1
: