Target
Isocitrate dehydrogenase [NADP] cytoplasmic [R132H]
Ligand
BDBM326769
Substrate
Meas. Tech.
Inhibition Assay
IC50
<500±n/a nM
Citation
 Cao, SPopovici-Muller, JSalituro, FGSaunders, JOTan, XTravins, JYan, SYe, Z Phenyl and pyridinyl substituted piperidines and piperazines as inhibitors of IDH1 mutants and their use in treating cancer US Patent  US9662327 Publication Date 5/30/2017 
Target
Name:
Isocitrate dehydrogenase [NADP] cytoplasmic [R132H]
Synonyms:
Cytosolic NADP-isocitrate dehydrogenase (IDH1)(R132H) IDH1 R132H IDHC_HUMAN Isocitrate dehydrogenase 1 mutant (R132H) Isocitrate dehydrogenase [NADP] cytoplasmic (IDH1)(R132H) PICD
Type:
Protein
Mol. Mass.:
46641.74
Organism:
Homo sapiens (Human)
Description:
Human IDH1 R132H (SEQ ID No. 2 in patent). First three are removed. Google patent parsed wrong.
Residue:
414
  
Inhibitor
Name:
BDBM326769
Synonyms:
US9662327, Compound 354
Type:
Small organic molecule
Emp. Form.:
C24H34N4O2
Mol. Mass.:
410.5524
SMILES:
CCC(=O)N1CCN(C[C@H]1C(C)C)c1nc(C2CC2)c2COC(C)(C)Cc2c1C#N
: