Target
Ribosomal protein S6 kinase beta-1
Ligand
BDBM224410
Substrate
Meas. Tech.
Enzyme Assay
IC50
8700±n/a nM
Citation
 Lan, RHuck, BRChen, XDeselm, LCQiu, HXiao, YNeagu, CMochalkin, IJohnson, TL Aminopyrimidine derivatives for use as modulators of kinase activity US Patent  US9662330 Publication Date 5/30/2017 
Target
Name:
Ribosomal protein S6 kinase beta-1
Synonyms:
70 kDa ribosomal protein S6 kinase 1 70 kDa ribosomal protein kinase (p70S6K) Protein kinase 70S6K (T412E) RPS6KB1 Ribosomal protein S6 kinase I STK14A p70S6K1
Type:
Enzyme
Mol. Mass.:
59139.89
Organism:
Homo sapiens (Human)
Description:
His-tagged S6K1.
Residue:
525
  
Inhibitor
Name:
BDBM224410
Synonyms:
US10080750, Compound 87 US9662330, Compound 87
Type:
Small organic molecule
Emp. Form.:
C22H27FN8
Mol. Mass.:
422.5018
SMILES:
Nc1ncnc(N2CCN(CC2)[C@H](CN2CCC2)c2cccc(F)c2)c1-c1cn[nH]c1
: