Target
Ribosomal protein S6 kinase beta-1
Ligand
BDBM224492
Substrate
Meas. Tech.
Enzyme Assay
IC50
12.0±n/a nM
Citation
 Lan, RHuck, BRChen, XDeselm, LCQiu, HXiao, YNeagu, CMochalkin, IJohnson, TL Aminopyrimidine derivatives for use as modulators of kinase activity US Patent  US9662330 Publication Date 5/30/2017 
Target
Name:
Ribosomal protein S6 kinase beta-1
Synonyms:
70 kDa ribosomal protein S6 kinase 1 70 kDa ribosomal protein kinase (p70S6K) Protein kinase 70S6K (T412E) RPS6KB1 Ribosomal protein S6 kinase I STK14A p70S6K1
Type:
Enzyme
Mol. Mass.:
59139.89
Organism:
Homo sapiens (Human)
Description:
His-tagged S6K1.
Residue:
525
  
Inhibitor
Name:
BDBM224492
Synonyms:
US10080750, Compound 170 US9662330, Compound 170
Type:
Small organic molecule
Emp. Form.:
C23H23F5N6
Mol. Mass.:
478.4609
SMILES:
NCC(N1CCN(CC1)c1ncnc(N)c1-c1ccc(F)cc1)c1ccc(cc1F)C(F)(F)F
: