Target
Ribosomal protein S6 kinase beta-1
Ligand
BDBM224525
Substrate
Meas. Tech.
Enzyme Assay
IC50
5.30±n/a nM
Citation
 Lan, RHuck, BRChen, XDeselm, LCQiu, HXiao, YNeagu, CMochalkin, IJohnson, TL Aminopyrimidine derivatives for use as modulators of kinase activity US Patent  US9662330 Publication Date 5/30/2017 
Target
Name:
Ribosomal protein S6 kinase beta-1
Synonyms:
70 kDa ribosomal protein S6 kinase 1 70 kDa ribosomal protein kinase (p70S6K) Protein kinase 70S6K (T412E) RPS6KB1 Ribosomal protein S6 kinase I STK14A p70S6K1
Type:
Enzyme
Mol. Mass.:
59139.89
Organism:
Homo sapiens (Human)
Description:
His-tagged S6K1.
Residue:
525
  
Inhibitor
Name:
BDBM224525
Synonyms:
US10080750, Compound 203 US9662330, Compound 203
Type:
Small organic molecule
Emp. Form.:
C22H22F2N6O
Mol. Mass.:
424.4465
SMILES:
Nc1ncnc(N2CCC(N)(CNC(=O)c3ccc(F)cc3F)C2)c1-c1ccccc1
: