Target
Leukotriene A-4 hydrolase
Ligand
BDBM327072
Substrate
Meas. Tech.
Enzyme Assay
IC50
0.160±n/a nM
Citation
 Bylock, LA Benzodioxane inhibitors of leukotriene production for combination therapy US Patent  US9662339 Publication Date 5/30/2017 
Target
Name:
Leukotriene A-4 hydrolase
Synonyms:
LKHA4_HUMAN LTA4 Leukotriene A(4) hydrolase Leukotriene A4 hydrolase
Type:
Hydrolase; metalloprotease
Mol. Mass.:
69280.41
Organism:
Homo sapiens (Human)
Description:
Human recombinant LTA4H.
Residue:
611
  
Inhibitor
Name:
BDBM327072
Synonyms:
1-{4-[(3S)-2,3- dihydro[1,4]dioxino[2,3- b]pyridin-3-yl]benzyl}piperidine- 4-carbonitrile | US9662339, 159
Type:
Small organic molecule
Emp. Form.:
C20H21N3O2
Mol. Mass.:
335.3996
SMILES:
N#CC1CCN(Cc2ccc(cc2)[C@H]2COc3cccnc3O2)CC1
: