Target
Leukotriene A-4 hydrolase
Ligand
BDBM327165
Substrate
Meas. Tech.
Enzyme Assay
IC50
0.170±n/a nM
Citation
 Bylock, LA Benzodioxane inhibitors of leukotriene production for combination therapy US Patent  US9662339 Publication Date 5/30/2017 
Target
Name:
Leukotriene A-4 hydrolase
Synonyms:
LKHA4_HUMAN LTA4 Leukotriene A(4) hydrolase Leukotriene A4 hydrolase
Type:
Hydrolase; metalloprotease
Mol. Mass.:
69280.41
Organism:
Homo sapiens (Human)
Description:
Human recombinant LTA4H.
Residue:
611
  
Inhibitor
Name:
BDBM327165
Synonyms:
US9662339, 248 | [(1alpha,5alpha,6alpha)-3-[(S)-4-(2,3- Dihydro-[1,4]dioxino[2,3- b]pyridin-3-yl)-benzyl]-3-aza- bicyclo[3.1.0]hexane]-6- carboxylic acid ((S)-2-hydroxy-1- methyl-ethyl)-amide
Type:
Small organic molecule
Emp. Form.:
C23H27N3O4
Mol. Mass.:
409.4782
SMILES:
C[C@@H](CO)NC(=O)[C@@H]1[C@H]2CN(Cc3ccc(cc3)[C@H]3COc4cccnc4O3)C[C@@H]12
: