Target
C-C chemokine receptor type 2
Ligand
BDBM327223
Substrate
Meas. Tech.
Biological Assay
IC50
94.0±n/a nM
Citation
 Yuan, HBeard, RLGarst, MEDonello, JELiu, XViswanath, V Sulfur derivatives as chemokine receptor modulators US Patent  US9663460 Publication Date 5/30/2017 
Target
Name:
C-C chemokine receptor type 2
Synonyms:
C-C chemokine receptor type 2 (CCR2) CCR2_HUMAN Chemoattractant Cytokine Receptor 2 (CCR2) Monocyte chemotactic protein-1 (MCP-1)
Type:
Enzyme
Mol. Mass.:
41932.32
Organism:
Homo sapiens (Human)
Description:
P41597
Residue:
374
  
Inhibitor
Name:
BDBM327223
Synonyms:
4-chloro-N-{5-chloro-2-[(pyridin-3-ylmethyl)thio]-phenyl}-3-(trifluoromethyl)benzenesulfonamide | US9663460, Example 10
Type:
Small organic molecule
Emp. Form.:
C19H13Cl2F3N2O2S2
Mol. Mass.:
493.35
SMILES:
FC(F)(F)c1cc(ccc1Cl)S(=O)(=O)Nc1cc(Cl)ccc1SCc1cccnc1
: