Target
C-C chemokine receptor type 2
Ligand
BDBM327251
Substrate
Meas. Tech.
Biological Assay
IC50
118±n/a nM
Citation
 Yuan, HBeard, RLGarst, MEDonello, JELiu, XViswanath, V Sulfur derivatives as chemokine receptor modulators US Patent  US9663460 Publication Date 5/30/2017 
Target
Name:
C-C chemokine receptor type 2
Synonyms:
C-C chemokine receptor type 2 (CCR2) CCR2_HUMAN Chemoattractant Cytokine Receptor 2 (CCR2) Monocyte chemotactic protein-1 (MCP-1)
Type:
Enzyme
Mol. Mass.:
41932.32
Organism:
Homo sapiens (Human)
Description:
P41597
Residue:
374
  
Inhibitor
Name:
BDBM327251
Synonyms:
2-{[4-chloro-2-({[4-chloro-3-(trifluoromethyl)-phenyl]sulfonyl}amino)phenyl]thio}-N,N-dimethylacetamide | US9663460, Example 40
Type:
Small organic molecule
Emp. Form.:
C17H15Cl2F3N2O3S2
Mol. Mass.:
487.344
SMILES:
CN(C)C(=O)CSc1ccc(Cl)cc1NS(=O)(=O)c1ccc(Cl)c(c1)C(F)(F)F
: