Target
C-C chemokine receptor type 2
Ligand
BDBM327307
Substrate
Meas. Tech.
Biological Assay
IC50
634±n/a nM
Citation
 Yuan, HBeard, RLGarst, MEDonello, JELiu, XViswanath, V Sulfur derivatives as chemokine receptor modulators US Patent  US9663460 Publication Date 5/30/2017 
Target
Name:
C-C chemokine receptor type 2
Synonyms:
C-C chemokine receptor type 2 (CCR2) CCR2_HUMAN Chemoattractant Cytokine Receptor 2 (CCR2) Monocyte chemotactic protein-1 (MCP-1)
Type:
Enzyme
Mol. Mass.:
41932.32
Organism:
Homo sapiens (Human)
Description:
P41597
Residue:
374
  
Inhibitor
Name:
BDBM327307
Synonyms:
N-{5-chloro-2-[(1H-pyrazol-3-ylmethyl)sulfinyl]-phenyl}-1-benzofuran-2-sulfonamide | US9663460, Example 107
Type:
Small organic molecule
Emp. Form.:
C18H14ClN3O4S2
Mol. Mass.:
435.904
SMILES:
Clc1ccc(c(NS(=O)(=O)c2cc3ccccc3o2)c1)S(=O)Cc1cc[nH]n1
: