Target
C-C chemokine receptor type 2
Ligand
BDBM327322
Substrate
Meas. Tech.
Biological Assay
IC50
262±n/a nM
Citation
 Yuan, HBeard, RLGarst, MEDonello, JELiu, XViswanath, V Sulfur derivatives as chemokine receptor modulators US Patent  US9663460 Publication Date 5/30/2017 
Target
Name:
C-C chemokine receptor type 2
Synonyms:
C-C chemokine receptor type 2 (CCR2) CCR2_HUMAN Chemoattractant Cytokine Receptor 2 (CCR2) Monocyte chemotactic protein-1 (MCP-1)
Type:
Enzyme
Mol. Mass.:
41932.32
Organism:
Homo sapiens (Human)
Description:
P41597
Residue:
374
  
Inhibitor
Name:
BDBM327322
Synonyms:
N-(2-{[(2-amino-1,3-thiazol-4-yl)methyl]sulfinyl}-5-chlorophenyl)-1-benzofuran-2-sulfonamide | US9663460, Example 125
Type:
Small organic molecule
Emp. Form.:
C18H14ClN3O4S3
Mol. Mass.:
467.969
SMILES:
Nc1nc(CS(=O)c2ccc(Cl)cc2NS(=O)(=O)c2cc3ccccc3o2)cs1
: