Target
C-C chemokine receptor type 2
Ligand
BDBM327325
Substrate
Meas. Tech.
Biological Assay
IC50
22.0±n/a nM
Citation
 Yuan, HBeard, RLGarst, MEDonello, JELiu, XViswanath, V Sulfur derivatives as chemokine receptor modulators US Patent  US9663460 Publication Date 5/30/2017 
Target
Name:
C-C chemokine receptor type 2
Synonyms:
C-C chemokine receptor type 2 (CCR2) CCR2_HUMAN Chemoattractant Cytokine Receptor 2 (CCR2) Monocyte chemotactic protein-1 (MCP-1)
Type:
Enzyme
Mol. Mass.:
41932.32
Organism:
Homo sapiens (Human)
Description:
P41597
Residue:
374
  
Inhibitor
Name:
BDBM327325
Synonyms:
N-{5-chloro-2-[(pyridin-3-ylmethyl)thio]phenyl}-1-benzofuran-2-sulfonamide | US9663460, Example 129
Type:
Small organic molecule
Emp. Form.:
C20H15ClN2O3S2
Mol. Mass.:
430.928
SMILES:
Clc1ccc(SCc2cccnc2)c(NS(=O)(=O)c2cc3ccccc3o2)c1
: