Target
C-C chemokine receptor type 2
Ligand
BDBM327374
Substrate
Meas. Tech.
Biological Assay
IC50
79.0±n/a nM
Citation
 Yuan, HBeard, RLGarst, MEDonello, JELiu, XViswanath, V Sulfur derivatives as chemokine receptor modulators US Patent  US9663460 Publication Date 5/30/2017 
Target
Name:
C-C chemokine receptor type 2
Synonyms:
C-C chemokine receptor type 2 (CCR2) CCR2_HUMAN Chemoattractant Cytokine Receptor 2 (CCR2) Monocyte chemotactic protein-1 (MCP-1)
Type:
Enzyme
Mol. Mass.:
41932.32
Organism:
Homo sapiens (Human)
Description:
P41597
Residue:
374
  
Inhibitor
Name:
BDBM327374
Synonyms:
N-(5-chloro-2-{[(2-fluoropyridin-3-yl)methyl]-sulfonyl}phenyl)-1-benzofuran-2-sulfonamide | US9663460, Example 181
Type:
Small organic molecule
Emp. Form.:
C20H14ClFN2O5S2
Mol. Mass.:
480.917
SMILES:
Fc1ncccc1CS(=O)(=O)c1ccc(Cl)cc1NS(=O)(=O)c1cc2ccccc2o1
: