Target
C-C chemokine receptor type 2
Ligand
BDBM327377
Substrate
Meas. Tech.
Biological Assay
IC50
19.0±n/a nM
Citation
 Yuan, HBeard, RLGarst, MEDonello, JELiu, XViswanath, V Sulfur derivatives as chemokine receptor modulators US Patent  US9663460 Publication Date 5/30/2017 
Target
Name:
C-C chemokine receptor type 2
Synonyms:
C-C chemokine receptor type 2 (CCR2) CCR2_HUMAN Chemoattractant Cytokine Receptor 2 (CCR2) Monocyte chemotactic protein-1 (MCP-1)
Type:
Enzyme
Mol. Mass.:
41932.32
Organism:
Homo sapiens (Human)
Description:
P41597
Residue:
374
  
Inhibitor
Name:
BDBM327377
Synonyms:
N-{5-chloro-2-[(trifluoromethyl)sulfinyl]phenyl}-1-benzofuran-2-sulfonamide | US9663460, Example 184
Type:
Small organic molecule
Emp. Form.:
C15H9ClF3NO4S2
Mol. Mass.:
423.814
SMILES:
FC(F)(F)S(=O)c1ccc(Cl)cc1NS(=O)(=O)c1cc2ccccc2o1
: