Target
C-C chemokine receptor type 2
Ligand
BDBM327383
Substrate
Meas. Tech.
Biological Assay
IC50
38.0±n/a nM
Citation
 Yuan, HBeard, RLGarst, MEDonello, JELiu, XViswanath, V Sulfur derivatives as chemokine receptor modulators US Patent  US9663460 Publication Date 5/30/2017 
Target
Name:
C-C chemokine receptor type 2
Synonyms:
C-C chemokine receptor type 2 (CCR2) CCR2_HUMAN Chemoattractant Cytokine Receptor 2 (CCR2) Monocyte chemotactic protein-1 (MCP-1)
Type:
Enzyme
Mol. Mass.:
41932.32
Organism:
Homo sapiens (Human)
Description:
P41597
Residue:
374
  
Inhibitor
Name:
BDBM327383
Synonyms:
N-{2-[(3-aminobenzyl)sulfinyl]-5-fluorophenyl}-1-benzofuran-2-sulfonamide | US9663460, Example 190
Type:
Small organic molecule
Emp. Form.:
C21H17FN2O4S2
Mol. Mass.:
444.499
SMILES:
Nc1cccc(CS(=O)c2ccc(F)cc2NS(=O)(=O)c2cc3ccccc3o2)c1
: