Target
C-C chemokine receptor type 2
Ligand
BDBM327397
Substrate
Meas. Tech.
Biological Assay
IC50
2159±n/a nM
Citation
 Yuan, HBeard, RLGarst, MEDonello, JELiu, XViswanath, V Sulfur derivatives as chemokine receptor modulators US Patent  US9663460 Publication Date 5/30/2017 
Target
Name:
C-C chemokine receptor type 2
Synonyms:
C-C chemokine receptor type 2 (CCR2) CCR2_HUMAN Chemoattractant Cytokine Receptor 2 (CCR2) Monocyte chemotactic protein-1 (MCP-1)
Type:
Enzyme
Mol. Mass.:
41932.32
Organism:
Homo sapiens (Human)
Description:
P41597
Residue:
374
  
Inhibitor
Name:
BDBM327397
Synonyms:
N-{5-chloro-2-[(4-nitrobenzyl)sulfonyl]phenyl}-1-benzofuran-2-sulfonamide | US9663460, Example 204
Type:
Small organic molecule
Emp. Form.:
C21H15ClN2O7S2
Mol. Mass.:
506.936
SMILES:
[O-][N+](=O)c1ccc(CS(=O)(=O)c2ccc(Cl)cc2NS(=O)(=O)c2cc3ccccc3o2)cc1
: