Target
C-C chemokine receptor type 2
Ligand
BDBM327422
Substrate
Meas. Tech.
Biological Assay
IC50
56.0±n/a nM
Citation
 Yuan, HBeard, RLGarst, MEDonello, JELiu, XViswanath, V Sulfur derivatives as chemokine receptor modulators US Patent  US9663460 Publication Date 5/30/2017 
Target
Name:
C-C chemokine receptor type 2
Synonyms:
C-C chemokine receptor type 2 (CCR2) CCR2_HUMAN Chemoattractant Cytokine Receptor 2 (CCR2) Monocyte chemotactic protein-1 (MCP-1)
Type:
Enzyme
Mol. Mass.:
41932.32
Organism:
Homo sapiens (Human)
Description:
P41597
Residue:
374
  
Inhibitor
Name:
BDBM327422
Synonyms:
N-[2-(benzylsulfonyl)-5-cyanophenyl]-1-benzofuran-2-sulfonamide | US9663460, Example 229
Type:
Small organic molecule
Emp. Form.:
C22H16N2O5S2
Mol. Mass.:
452.503
SMILES:
O=S(=O)(Cc1ccccc1)c1ccc(cc1NS(=O)(=O)c1cc2ccccc2o1)C#N
: