Target
Collagenase ColG
Ligand
BDBM11803
Substrate
BDBM11462
Meas. Tech.
ChC Enzyme Inhibition Assay
Ki
9±n/a nM
Citation
 Scozzafava, ASupuran, CT Protease inhibitors. Part 8: synthesis of potent Clostridium histolyticum collagenase inhibitors incorporating sulfonylated L-alanine hydroxamate moieties. Bioorg Med Chem 8:637-45 (2000)  
Target
Name:
Collagenase ColG
Synonyms:
3.4.24.3 Class I collagenase Collagenase ColG Microbial collagenase colG
Type:
Enzyme
Mol. Mass.:
126246.16
Organism:
Clostridium histolyticum
Description:
Q9S0X0
Residue:
1118
  
Inhibitor
Name:
BDBM11803
Synonyms:
2-{[(2-chlorophenyl)methyl]({[(4-fluorobenzene)sulfonyl]carbamoyl})amino}-N-hydroxypropanamide | hydroxamate deriv. D1
Type:
Small organic molecule
Emp. Form.:
C17H17ClFN3O5S
Mol. Mass.:
429.85
SMILES:
CC(N(Cc1ccccc1Cl)C(=O)NS(=O)(=O)c1ccc(F)cc1)C(=O)NO
:
Substrate
Name:
BDBM11462
Synonyms:
Collagenase Substrate furanacryloyl-leucyl-glycyl-prolyl-alanine
Type:
Emp. Form.:
C23H32N4O7
Mol. Mass.:
476.5228
SMILES:
CC(C)C[C@H](NC(=O)\C=C\c1ccco1)C(=O)NCC(=O)N1CCC[C@H]1C(=O)N[C@@H](C)C(O)=O
: