Target
Collagenase ColG
Ligand
BDBM11815
Substrate
BDBM11462
Meas. Tech.
ChC Enzyme Inhibition Assay
Ki
11±n/a nM
Citation
 Scozzafava, ASupuran, CT Protease inhibitors. Part 8: synthesis of potent Clostridium histolyticum collagenase inhibitors incorporating sulfonylated L-alanine hydroxamate moieties. Bioorg Med Chem 8:637-45 (2000)  
Target
Name:
Collagenase ColG
Synonyms:
3.4.24.3 Class I collagenase Collagenase ColG Microbial collagenase colG
Type:
Enzyme
Mol. Mass.:
126246.16
Organism:
Clostridium histolyticum
Description:
Q9S0X0
Residue:
1118
  
Inhibitor
Name:
BDBM11815
Synonyms:
2-{[(2-chlorophenyl)methyl][(2,4-dinitrophenyl)sulfanyl]amino}-N-hydroxypropanamide | hydroxamate deriv. H3
Type:
Small organic molecule
Emp. Form.:
C16H15ClN4O6S
Mol. Mass.:
426.832
SMILES:
CC(N(Cc1ccccc1Cl)Sc1ccc(cc1[N+]([O-])=O)[N+]([O-])=O)C(=O)NO
:
Substrate
Name:
BDBM11462
Synonyms:
Collagenase Substrate furanacryloyl-leucyl-glycyl-prolyl-alanine
Type:
Emp. Form.:
C23H32N4O7
Mol. Mass.:
476.5228
SMILES:
CC(C)C[C@H](NC(=O)\C=C\c1ccco1)C(=O)NCC(=O)N1CCC[C@H]1C(=O)N[C@@H](C)C(O)=O
: