Target
Lysine-specific histone demethylase 1A
Ligand
BDBM193883
Substrate
Meas. Tech.
LSD1 Histone Demethylase Biochemical Assay
pH
7.5±n/a
IC50
<100±n/a nM
Comments
extracted
Citation
 Wu, LHe, CYao, WZhang, F Cyclopropylamines as LSD1 inhibitors US Patent  US9670210 Publication Date 6/6/2017 
Target
Name:
Lysine-specific histone demethylase 1A
Synonyms:
AOF2 Flavin-containing amine oxidase domain-containing protein 2 KDM1A KIAA0601 Lysine-specific demethylase 1 (LSD1) Lysine-specific histone demethylase 1 (LSD1)
Type:
Enzyme
Mol. Mass.:
92901.01
Organism:
Homo sapiens (Human)
Description:
O60341
Residue:
852
  
Inhibitor
Name:
BDBM193883
Synonyms:
US10174030, Example 16 US11247992, Example 16 | US9670210, Example 16 4-Phenyl-1-[(3-{[(trans-2-phenylcyclopropyl)amino]methyl}azetidin-1-yl)carbonyl]piperidine-4-carbonitrile
Type:
Small organic molecule
Emp. Form.:
C26H30N4O
Mol. Mass.:
414.5426
SMILES:
O=C(N1CC(CNC2CC2c2ccccc2)C1)N1CCC(CC1)(C#N)c1ccccc1
: