Target
Lysine-specific histone demethylase 1A
Ligand
BDBM194088
Substrate
Meas. Tech.
LSD1 Histone Demethylase Biochemical Assay
pH
7.5±n/a
IC50
<100±n/a nM
Comments
extracted
Citation
 Wu, LHe, CYao, WZhang, F Cyclopropylamines as LSD1 inhibitors US Patent  US9670210 Publication Date 6/6/2017 
Target
Name:
Lysine-specific histone demethylase 1A
Synonyms:
AOF2 Flavin-containing amine oxidase domain-containing protein 2 KDM1A KIAA0601 Lysine-specific demethylase 1 (LSD1) Lysine-specific histone demethylase 1 (LSD1)
Type:
Enzyme
Mol. Mass.:
92901.01
Organism:
Homo sapiens (Human)
Description:
O60341
Residue:
852
  
Inhibitor
Name:
BDBM194088
Synonyms:
US10174030, Example 18 US11247992, Example 18 | US9670210, Example 18 N-({1-[(5-Fluoro-1,2-dihydro-spiro[indole-3,4′-piperidin]-1′-yl)carbonyl]azetidin-3-yl}methyl)-trans-2-phenylcyclopropanamine
Type:
Small organic molecule
Emp. Form.:
C26H31FN4O
Mol. Mass.:
434.5489
SMILES:
Fc1ccc2NCC3(CCN(CC3)C(=O)N3CC(CNC4CC4c4ccccc4)C3)c2c1
: