Target
Lysine-specific histone demethylase 1A
Ligand
BDBM194130
Substrate
Meas. Tech.
LSD1 Histone Demethylase Biochemical Assay
pH
7.5±n/a
IC50
<100±n/a nM
Comments
extracted
Citation
 Wu, LHe, CYao, WZhang, F Cyclopropylamines as LSD1 inhibitors US Patent  US9670210 Publication Date 6/6/2017 
Target
Name:
Lysine-specific histone demethylase 1A
Synonyms:
AOF2 Flavin-containing amine oxidase domain-containing protein 2 KDM1A KIAA0601 Lysine-specific demethylase 1 (LSD1) Lysine-specific histone demethylase 1 (LSD1)
Type:
Enzyme
Mol. Mass.:
92901.01
Organism:
Homo sapiens (Human)
Description:
O60341
Residue:
852
  
Inhibitor
Name:
BDBM194130
Synonyms:
US10174030, Example 32 US11247992, Example 32 | US9670210, Example 32 1-{[4-(4-fluorobenzyl)-4-({[(1R,2S)-2-phenylcyclopropyl]amino}methyl)piperidin-1-yl]methyl}cyclobutanecarboxylic acid
Type:
Small organic molecule
Emp. Form.:
C28H35FN2O2
Mol. Mass.:
450.5881
SMILES:
OC(=O)C1(CN2CCC(CN[C@@H]3CC3c3ccccc3)(Cc3ccc(F)cc3)CC2)CCC1
: