Target
Lysine-specific histone demethylase 1A
Ligand
BDBM194675
Substrate
Meas. Tech.
LSD1 Histone Demethylase Biochemical Assay
pH
7.5±n/a
IC50
<100±n/a nM
Comments
extracted
Citation
 Wu, LHe, CYao, WZhang, F Cyclopropylamines as LSD1 inhibitors US Patent  US9670210 Publication Date 6/6/2017 
Target
Name:
Lysine-specific histone demethylase 1A
Synonyms:
AOF2 Flavin-containing amine oxidase domain-containing protein 2 KDM1A KIAA0601 Lysine-specific demethylase 1 (LSD1) Lysine-specific histone demethylase 1 (LSD1)
Type:
Enzyme
Mol. Mass.:
92901.01
Organism:
Homo sapiens (Human)
Description:
O60341
Residue:
852
  
Inhibitor
Name:
BDBM194675
Synonyms:
US10174030, Example 66 US11247992, Example 66 | US9670210, Example 66 1-{[4-(methoxymethyl)-4-({[2-(2-methoxyphenyl)cyclopropyl]amino}methyl)piperidin-1-yl]methyl}cyclobutanecarboxylic acid
Type:
Small organic molecule
Emp. Form.:
C24H36N2O4
Mol. Mass.:
416.5536
SMILES:
COCC1(CNC2CC2c2ccccc2OC)CCN(CC2(CCC2)C(O)=O)CC1
: