Target
Lysine-specific histone demethylase 1A
Ligand
BDBM194714
Substrate
Meas. Tech.
LSD1 Histone Demethylase Biochemical Assay
pH
7.5±n/a
IC50
<100±n/a nM
Comments
extracted
Citation
 Wu, LHe, CYao, WZhang, F Cyclopropylamines as LSD1 inhibitors US Patent  US9670210 Publication Date 6/6/2017 
Target
Name:
Lysine-specific histone demethylase 1A
Synonyms:
AOF2 Flavin-containing amine oxidase domain-containing protein 2 KDM1A KIAA0601 Lysine-specific demethylase 1 (LSD1) Lysine-specific histone demethylase 1 (LSD1)
Type:
Enzyme
Mol. Mass.:
92901.01
Organism:
Homo sapiens (Human)
Description:
O60341
Residue:
852
  
Inhibitor
Name:
BDBM194714
Synonyms:
US10174030, Example 100 US11247992, Example 100 | US9670210, Example 100 (trans-4-{[4-(methoxymethyl)-4-({[(1R,2S)-2-phenylcyclopropyl]amino}methyl)piperidin-1-yl]carbonyl}cyclohexyl)methanol
Type:
Small organic molecule
Emp. Form.:
C25H38N2O3
Mol. Mass.:
414.5808
SMILES:
COCC1(CN[C@@H]2CC2c2ccccc2)CCN(CC1)C(=O)[C@H]1CC[C@H](CO)CC1
: