Target
Acetylcholinesterase
Ligand
BDBM327467
Substrate
Meas. Tech.
Inhibition Assay
IC50
320±n/a nM
Citation
 Dallemagne, PRochais, CLecoutey, CBoulouard, MFreret, T Acetylcholinesterase inhibitors and promnesiant serotonin 5-HT4 receptor agonists, their methods of preparation and the pharmaceutical compositions containing the same US Patent  US9663465 Publication Date 5/30/2017 
Target
Name:
Acetylcholinesterase
Synonyms:
ACES_HUMAN Acetylcholinesterase (AChE) | Acetylcholinesterase (human AChE)
Type:
Enzyme
Mol. Mass.:
67792.70
Organism:
Homo sapiens (Human)
Description:
P22303
Residue:
614
  
Inhibitor
Name:
BDBM327467
Synonyms:
2-chloro-4-[[2-[1-(cyclohexylmethyl)-4-piperidyl]ethyl]-N-methoxycarbonimidoyl]-5-methoxyaniline | US9663465, 24
Type:
Small organic molecule
Emp. Form.:
C23H36ClN3O2
Mol. Mass.:
422.004
SMILES:
CON=C(CCC1CCN(CC2CCCCC2)CC1)c1cc(Cl)c(N)cc1OC
: