Target
Nuclear receptor ROR-gamma [262-507]
Ligand
BDBM327689
Substrate
Meas. Tech.
Spa Binding Assay
IC50
18.9±n/a nM
Citation
 Dhar, TGDuan, JGong, HJiang, BLu, ZWeinstein, DS RORγ modulators US Patent  US9663469 Publication Date 5/30/2017 
Target
Name:
Nuclear receptor ROR-gamma [262-507]
Synonyms:
NR1F3 Nuclear receptor ROR-gamma (aa 262-507) RORC RORG_HUMAN | RZRG
Type:
Enzyme Catalytic Domain
Mol. Mass.:
28605.37
Organism:
Homo sapiens (Human)
Description:
aa 262-507
Residue:
246
  
Inhibitor
Name:
BDBM327689
Synonyms:
US9663469, 236
Type:
Small organic molecule
Emp. Form.:
C31H28F8N2O4S
Mol. Mass.:
676.617
SMILES:
OC(c1ccc2N([C@H](CC(=O)N[C@H]3CCC[C@H]3c3ccc(F)cc3)CCc2c1)S(=O)(=O)c1ccc(F)cc1)(C(F)(F)F)C(F)(F)F
: