Target
11-beta-hydroxysteroid dehydrogenase 1
Ligand
BDBM177608
Substrate
Meas. Tech.
Homogeneous Time-Resolved Fluorescence (HTRF)
IC50
3137±n/a nM
Citation
 Eckhardt, MHimmelsbach, FZhuang, LPeters, SNar, H Aryl- and heteroarylcarbonyl derivatives of hexahydroindenopyridine and octahydrobenzoquinoline US Patent  US9663470 Publication Date 5/30/2017 
Target
Name:
11-beta-hydroxysteroid dehydrogenase 1
Synonyms:
11-DH 11-beta-Hydroxysteroid Dehydrogenase 1 (11-beta-HSD1) 11-beta-hydroxysteroid dehydrogenase 1 (11HSD1) Corticosteroid 11-beta-dehydrogenase isozyme 1 (11-beta-HSD-1) Corticosteroid 11-beta-dehydrogenase isozyme 1 (11beta-HSD1) HSD11 HSD11L | SDR26C1
Type:
Enzyme
Mol. Mass.:
32409.16
Organism:
Homo sapiens (Human)
Description:
P28845
Residue:
292
  
Inhibitor
Name:
BDBM177608
Synonyms:
US9120769, 35 | US9663470, 35
Type:
Small organic molecule
Emp. Form.:
C22H21N3O3
Mol. Mass.:
375.4204
SMILES:
OC(=O)c1ccc2C3CCCN([C@H]3CCc2c1)C(=O)c1ccc2[nH]cnc2c1
: