Target
11-beta-hydroxysteroid dehydrogenase 1
Ligand
BDBM177619
Substrate
Meas. Tech.
Homogeneous Time-Resolved Fluorescence (HTRF)
IC50
2058±n/a nM
Citation
 Eckhardt, MHimmelsbach, FZhuang, LPeters, SNar, H Aryl- and heteroarylcarbonyl derivatives of hexahydroindenopyridine and octahydrobenzoquinoline US Patent  US9663470 Publication Date 5/30/2017 
Target
Name:
11-beta-hydroxysteroid dehydrogenase 1
Synonyms:
11-DH 11-beta-Hydroxysteroid Dehydrogenase 1 (11-beta-HSD1) 11-beta-hydroxysteroid dehydrogenase 1 (11HSD1) Corticosteroid 11-beta-dehydrogenase isozyme 1 (11-beta-HSD-1) Corticosteroid 11-beta-dehydrogenase isozyme 1 (11beta-HSD1) HSD11 HSD11L | SDR26C1
Type:
Enzyme
Mol. Mass.:
32409.16
Organism:
Homo sapiens (Human)
Description:
P28845
Residue:
292
  
Inhibitor
Name:
BDBM177619
Synonyms:
US9120769, 83 | US9663470, 83
Type:
Small organic molecule
Emp. Form.:
C28H33N3O
Mol. Mass.:
427.5811
SMILES:
O=C(N1CCCC2[C@@H]1CCc1cc(CC3CCCCC3)ccc21)c1ccc2[nH]cnc2c1
: