Target
11-beta-hydroxysteroid dehydrogenase 1
Ligand
BDBM99428
Substrate
Meas. Tech.
Homogeneous Time-Resolved Fluorescence (HTRF)
IC50
484±n/a nM
Citation
 Eckhardt, MHimmelsbach, FZhuang, LPeters, SNar, H Aryl- and heteroarylcarbonyl derivatives of hexahydroindenopyridine and octahydrobenzoquinoline US Patent  US9663470 Publication Date 5/30/2017 
Target
Name:
11-beta-hydroxysteroid dehydrogenase 1
Synonyms:
11-DH 11-beta-Hydroxysteroid Dehydrogenase 1 (11-beta-HSD1) 11-beta-hydroxysteroid dehydrogenase 1 (11HSD1) Corticosteroid 11-beta-dehydrogenase isozyme 1 (11-beta-HSD-1) Corticosteroid 11-beta-dehydrogenase isozyme 1 (11beta-HSD1) HSD11 HSD11L | SDR26C1
Type:
Enzyme
Mol. Mass.:
32409.16
Organism:
Homo sapiens (Human)
Description:
P28845
Residue:
292
  
Inhibitor
Name:
BDBM99428
Synonyms:
US8497281, 206 US9663470, 139
Type:
Small organic molecule
Emp. Form.:
C22H22N2O
Mol. Mass.:
330.4229
SMILES:
Cn1cc(C(=O)N2CCCC3[C@@H]2Cc2ccccc32)c2ccccc12
: