Target
11-beta-hydroxysteroid dehydrogenase 1
Ligand
BDBM99434
Substrate
Meas. Tech.
Homogeneous Time-Resolved Fluorescence (HTRF)
IC50
777±n/a nM
Citation
 Eckhardt, MHimmelsbach, FZhuang, LPeters, SNar, H Aryl- and heteroarylcarbonyl derivatives of hexahydroindenopyridine and octahydrobenzoquinoline US Patent  US9663470 Publication Date 5/30/2017 
Target
Name:
11-beta-hydroxysteroid dehydrogenase 1
Synonyms:
11-DH 11-beta-Hydroxysteroid Dehydrogenase 1 (11-beta-HSD1) 11-beta-hydroxysteroid dehydrogenase 1 (11HSD1) Corticosteroid 11-beta-dehydrogenase isozyme 1 (11-beta-HSD-1) Corticosteroid 11-beta-dehydrogenase isozyme 1 (11beta-HSD1) HSD11 HSD11L | SDR26C1
Type:
Enzyme
Mol. Mass.:
32409.16
Organism:
Homo sapiens (Human)
Description:
P28845
Residue:
292
  
Inhibitor
Name:
BDBM99434
Synonyms:
US8497281, 212 US9663470, 145
Type:
Small organic molecule
Emp. Form.:
C19H19FN2O
Mol. Mass.:
310.3654
SMILES:
Nc1ccc(cc1F)C(=O)N1CCCC2[C@@H]1Cc1ccccc21
: