Target
11-beta-hydroxysteroid dehydrogenase 1
Ligand
BDBM99436
Substrate
Meas. Tech.
Homogeneous Time-Resolved Fluorescence (HTRF)
IC50
1738±n/a nM
Citation
 Eckhardt, MHimmelsbach, FZhuang, LPeters, SNar, H Aryl- and heteroarylcarbonyl derivatives of hexahydroindenopyridine and octahydrobenzoquinoline US Patent  US9663470 Publication Date 5/30/2017 
Target
Name:
11-beta-hydroxysteroid dehydrogenase 1
Synonyms:
11-DH 11-beta-Hydroxysteroid Dehydrogenase 1 (11-beta-HSD1) 11-beta-hydroxysteroid dehydrogenase 1 (11HSD1) Corticosteroid 11-beta-dehydrogenase isozyme 1 (11-beta-HSD-1) Corticosteroid 11-beta-dehydrogenase isozyme 1 (11beta-HSD1) HSD11 HSD11L | SDR26C1
Type:
Enzyme
Mol. Mass.:
32409.16
Organism:
Homo sapiens (Human)
Description:
P28845
Residue:
292
  
Inhibitor
Name:
BDBM99436
Synonyms:
US8497281, 147 US9663470, 147
Type:
Small organic molecule
Emp. Form.:
C21H19N3O2
Mol. Mass.:
345.3945
SMILES:
O=C(N1CCCC2[C@@H]1Cc1ccccc21)c1ccc2[nH]c(=O)cnc2c1
: