Target
11-beta-hydroxysteroid dehydrogenase 1
Ligand
BDBM327955
Substrate
Meas. Tech.
Homogeneous Time-Resolved Fluorescence (HTRF)
IC50
>100.0±n/a nM
Citation
 Eckhardt, MHimmelsbach, FZhuang, LPeters, SNar, H Aryl- and heteroarylcarbonyl derivatives of hexahydroindenopyridine and octahydrobenzoquinoline US Patent  US9663470 Publication Date 5/30/2017 
Target
Name:
11-beta-hydroxysteroid dehydrogenase 1
Synonyms:
11-DH 11-beta-Hydroxysteroid Dehydrogenase 1 (11-beta-HSD1) 11-beta-hydroxysteroid dehydrogenase 1 (11HSD1) Corticosteroid 11-beta-dehydrogenase isozyme 1 (11-beta-HSD-1) Corticosteroid 11-beta-dehydrogenase isozyme 1 (11beta-HSD1) HSD11 HSD11L | SDR26C1
Type:
Enzyme
Mol. Mass.:
32409.16
Organism:
Homo sapiens (Human)
Description:
P28845
Residue:
292
  
Inhibitor
Name:
BDBM327955
Synonyms:
(4a-S,9a-R)-1-(1H-Benzoimidazole-5-carbonyl)-5-methyl-2,3,4,4a,9,9a-hexahydro-1H-indeno[2,1-b]pyridine-6-carbonitrile | US9663470, 177
Type:
Small organic molecule
Emp. Form.:
C22H19N4O
Mol. Mass.:
355.4125
SMILES:
Cc1c2[C@@H]3CCCN([C@@H]3Cc2ccc1C#N)C(=O)c1ccc2ncnc2c1
: