Target
Cathepsin D
Ligand
BDBM327803
Substrate
Meas. Tech.
IN-VITRO FLUORESCENCE ASSAY
IC50
270±n/a nM
Citation
 Klein, MTsaklakidis, C 2 amino-3,4-dihydrcquinazoline derivatives and the use thereof as cathepsin D inhibitors US Patent  US9663475 Publication Date 5/30/2017 
Target
Name:
Cathepsin D
Synonyms:
CATD_HUMAN CTSD Cathepsin D heavy chain Cathepsin D precursor
Type:
Enzyme
Mol. Mass.:
44551.72
Organism:
Homo sapiens (Human)
Description:
Human proCathepsin D (SwissProt accession number P07339) was expressed in Sf9 cells, purified, and autoactivated.
Residue:
412
  
Inhibitor
Name:
BDBM327803
Synonyms:
US9663475, Compound A18
Type:
Small organic molecule
Emp. Form.:
C19H18F3N3O
Mol. Mass.:
361.3609
SMILES:
COc1ccc2C[C@@H](Cc2c1)N1Cc2ccc(cc2N=C1N)C(F)(F)F
: