Target
5'-AMP-activated protein kinase catalytic subunit alpha-2
Ligand
BDBM327910
Substrate
Meas. Tech.
Enzyme-Linked Immunosorbent Assay
EC50
<500±n/a nM
Citation
 Irving, MShaw, S AMPK-activating heterocyclic compounds and methods for using the same US Patent  US9663496 Publication Date 5/30/2017 
Target
Name:
5'-AMP-activated protein kinase catalytic subunit alpha-2
Synonyms:
AAPK2_HUMAN AMP-activated protein kinase, alpha-2 subunit AMPK subunit alpha-2 AMPK2 Hydroxymethylglutaryl-CoA reductase kinase | PRKAA2
Type:
Enzyme
Mol. Mass.:
62331.02
Organism:
Homo sapiens (Human)
Description:
P54646
Residue:
552
  
Inhibitor
Name:
BDBM327910
Synonyms:
N-(1-(4- chlorobenzyl)piperidin- 4-yl)-5-(4-(4- fluorobenzyl)piperazine- 1-carbonyl)picolinamide US9663496, Compound 51
Type:
Small organic molecule
Emp. Form.:
C32H37FN4O3
Mol. Mass.:
544.6596
SMILES:
COc1ccc(CC2CCC(CC2)NC(=O)c2ccc(cn2)C(=O)N2CCN(Cc3ccc(F)cc3)CC2)cc1
: