Target
5'-AMP-activated protein kinase catalytic subunit alpha-2
Ligand
BDBM327961
Substrate
Meas. Tech.
Enzyme-Linked Immunosorbent Assay
EC50
3000±n/a nM
Citation
 Irving, MShaw, S AMPK-activating heterocyclic compounds and methods for using the same US Patent  US9663496 Publication Date 5/30/2017 
Target
Name:
5'-AMP-activated protein kinase catalytic subunit alpha-2
Synonyms:
AAPK2_HUMAN AMP-activated protein kinase, alpha-2 subunit AMPK subunit alpha-2 AMPK2 Hydroxymethylglutaryl-CoA reductase kinase | PRKAA2
Type:
Enzyme
Mol. Mass.:
62331.02
Organism:
Homo sapiens (Human)
Description:
P54646
Residue:
552
  
Inhibitor
Name:
BDBM327961
Synonyms:
US10377742, Compound 98 ethyl 2-(4-(5-(4-(4- fluorobenzyl)piperazine- 1- carbonyl)picolinamido) piperidin-1-yl)-2- phenylacetate
Type:
Small organic molecule
Emp. Form.:
C33H38FN5O4
Mol. Mass.:
587.6843
SMILES:
CCOC(=O)C(N1CCC(CC1)NC(=O)c1ccc(cn1)C(=O)N1CCN(Cc2ccc(F)cc2)CC1)c1ccccc1
: